BDBM50055384 (3-Aminooxalyl-1-biphenyl-3-ylmethyl-2-methyl-1H-indol-4-yloxy)-acetic acid::CHEMBL355944
SMILES Cc1c(C(=O)C(N)=O)c2c(OCC(O)=O)cccc2n1Cc1cccc(c1)-c1ccccc1
InChI Key InChIKey=CXAFWBHDYGONMZ-UHFFFAOYSA-N
Data  7 IC50
  Tab Delimited (TSV)   2D SDfile   Computed 3D by Vconf -m prep SDfile
Find this compound or compounds like it in BindingDB:
Activity Spreadsheet -- Enzyme Inhibition Constant Data from BindingDB
Found 3 hits for monomerid = 50055384
TargetPhospholipase A2, major isoenzyme(Sus scrofa (pig))
Niddk
Curated by ChEMBL
LigandPNGBDBM50055384((3-Aminooxalyl-1-biphenyl-3-ylmethyl-2-methyl-1H-i...)
Affinity DataIC50:  7nM. Assay description: Inhibition of pig group IB phospholipase A2 incubated for 1 hrs by scintillation counter analysis
In DepthDetails PubMed
TargetPhospholipase A2, membrane associated(Homo sapiens (Human))
Niddk
Curated by ChEMBL
LigandPNGBDBM50055384((3-Aminooxalyl-1-biphenyl-3-ylmethyl-2-methyl-1H-i...)
Affinity DataIC50:  9nM. Assay description: Inhibition of human group IIA phospholipase A2 incubated for 1 hrs by scintillation counter analysis
In DepthDetails PubMed
TargetPhospholipase A2(Homo sapiens (Human))
Niddk
Curated by ChEMBL
LigandPNGBDBM50055384((3-Aminooxalyl-1-biphenyl-3-ylmethyl-2-methyl-1H-i...)
Affinity DataIC50:  570nM. Assay description: Inhibition of human group IB phospholipase A2 incubated for 1 hrs by scintillation counter analysis
In DepthDetails PubMed