BDBM50056259 (3S,6S)-3-Mercaptomethyl-4-oxo-5-aza-bicyclo[11.3.1]heptadeca-1(16),13(17),14-triene-6-carboxylic acid::CHEMBL357584
SMILES OC(=O)[C@@H]1CCCCCCc2cccc(C[C@H](CS)C(=O)N1)c2
InChI Key InChIKey=KLCDUNQMSZJEDY-CVEARBPZSA-N
Data  3 IC50
  Tab Delimited (TSV)   2D SDfile   Computed 3D by Vconf -m prep SDfile
Find this compound or compounds like it in BindingDB:
Activity Spreadsheet -- Enzyme Inhibition Constant Data from BindingDB
Found 3 hits for monomerid = 50056259
TargetNeprilysin(Homo sapiens (Human))
Ciba-Geigy
Curated by ChEMBL
LigandPNGBDBM50056259((3S,6S)-3-Mercaptomethyl-4-oxo-5-aza-bicyclo[11.3....)
Affinity DataIC50:  4nM. Assay description: Inhibitory concentration required to inhibit neutral endopeptidase (NEP)
In DepthDetails ArticlePubMed
TargetThermolysin(Bacillus thermoproteolyticus)
Ciba-Geigy
Curated by ChEMBL
LigandPNGBDBM50056259((3S,6S)-3-Mercaptomethyl-4-oxo-5-aza-bicyclo[11.3....)
Affinity DataIC50:  3.40E+4nM. Assay description: Inhibitory concentration required to inhibit thermolysin (TLN)
In DepthDetails ArticlePubMed
TargetAngiotensin-converting enzyme(Homo sapiens (Human))
Ciba-Geigy
Curated by ChEMBL
LigandPNGBDBM50056259((3S,6S)-3-Mercaptomethyl-4-oxo-5-aza-bicyclo[11.3....)
Affinity DataIC50:  175nM. Assay description: Inhibitory concentration required to inhibit Angiotensin I converting enzyme (ACE)
In DepthDetails ArticlePubMed