BDBM50056899 2-Hydroxy-benzoic acid N'-(2-amino-benzoyl)-hydrazide::CHEMBL173334
SMILES Nc1ccccc1C(=O)NNC(=O)c1ccccc1O
InChI Key InChIKey=ZELPKRZUDOCMIO-UHFFFAOYSA-N
Data  2 IC50
  Tab Delimited (TSV)   2D SDfile   Computed 3D by Vconf -m prep SDfile
Find this compound or compounds like it in BindingDB:
Activity Spreadsheet -- Enzyme Inhibition Constant Data from BindingDB
Found 2 hits for monomerid = 50056899
TargetIntegrase(Human immunodeficiency virus 1)
National Cancer Institute-Bethesda
Curated by ChEMBL
LigandPNGBDBM50056899(2-Hydroxy-benzoic acid N'-(2-amino-benzoyl)-hydraz...)
Affinity DataIC50: >1.00E+5nM. Assay description: Inhibition of HIV-1 integrase enzyme
In DepthDetails ArticlePubMed
TargetIntegrase(Human immunodeficiency virus 1)
National Cancer Institute-Bethesda
Curated by ChEMBL
LigandPNGBDBM50056899(2-Hydroxy-benzoic acid N'-(2-amino-benzoyl)-hydraz...)
Affinity DataIC50: >1.00E+5nM. Assay description: Inhibition of HIV-1 integrase enzyme by 3'-processing method
In DepthDetails ArticlePubMed