BDBM50057846 (5aS,11bS)-2-Methyl-4,5,5a,6,7,11b-hexahydro-1-thia-5-aza-cyclopenta[c]phenanthrene-9,10-diol::CHEMBL41132
SMILES Cc1cc2CN[C@H]3CCc4cc(O)c(O)cc4[C@@H]3c2s1
InChI Key InChIKey=GYRLGNMXIAYTEM-WFASDCNBSA-N
Data  2 KI  1 EC50
  Tab Delimited (TSV)   2D SDfile   Computed 3D by Vconf -m prep SDfile
Find this compound or compounds like it in BindingDB:
Activity Spreadsheet -- Enzyme Inhibition Constant Data from BindingDB
Found 3 hits for monomerid = 50057846
TargetD(1A) dopamine receptor(RAT)
Abbott Laboratories
Curated by ChEMBL
LigandPNGBDBM50057846((5aS,11bS)-2-Methyl-4,5,5a,6,7,11b-hexahydro-1-thi...)
Affinity DataKi:  18nM. Assay description: In vitro binding affinity against Dopamine receptor D1 like from rat caudate membrane using [125I]-SCH as radioligand
In DepthDetails ArticlePubMed
TargetD(2) dopamine receptor(Rattus norvegicus (rat))
Abbott Laboratories
Curated by ChEMBL
LigandPNGBDBM50057846((5aS,11bS)-2-Methyl-4,5,5a,6,7,11b-hexahydro-1-thi...)
Affinity DataKi:  205nM. Assay description: In vitro binding affinity against Dopamine receptor D2 like from rat caudate membrane using [3H]-spiperone as radioligand
In DepthDetails ArticlePubMed
TargetD(1) dopamine receptor(Carassius auratus)
Abbott Laboratories
Curated by ChEMBL
LigandPNGBDBM50057846((5aS,11bS)-2-Methyl-4,5,5a,6,7,11b-hexahydro-1-thi...)
Affinity DataEC50:  11nM. Assay description: Ability to stimulate the Dopamine receptor D1 like was assayed by measuring cAMP production in cell free homogenates of goldfish retinal tissue
In DepthDetails ArticlePubMed