BDBM50058006 2-[4-(4-Iodo-phenoxymethyl)-piperidin-1-ylmethyl]-benzonitrile::CHEMBL295626
SMILES Ic1ccc(OCC2CCN(Cc3ccccc3C#N)CC2)cc1
InChI Key InChIKey=YKWMTMFWNNHUDV-UHFFFAOYSA-N
Data  1 KI
  Tab Delimited (TSV)   2D SDfile   Computed 3D by Vconf -m prep SDfile
Find this compound or compounds like it in BindingDB:
Activity Spreadsheet -- Enzyme Inhibition Constant Data from BindingDB
Found 1 hit for monomerid = 50058006
LigandPNGBDBM50058006(2-[4-(4-Iodo-phenoxymethyl)-piperidin-1-ylmethyl]-...)
Affinity DataKi:  10.5nM. Assay description: In vitro for binding affinity at sigma-1 receptor by measuring its ability to displace [3H]-(+)-pentazocine from guinea pig membranes
In DepthDetails ArticlePubMed