BDBM50058057 CHEMBL3329236::US9260448, 2
SMILES Fc1ccccc1-n1cnc2c(csc2c1=O)-c1ccccc1
InChI Key InChIKey=ZTOAXEZHBPCZRO-UHFFFAOYSA-N
Data  2 IC50
  Tab Delimited (TSV)   2D SDfile   Computed 3D by Vconf -m prep SDfile
Find this compound or compounds like it in BindingDB:
Activity Spreadsheet -- Enzyme Inhibition Constant Data from BindingDB
Found 2 hits for monomerid = 50058057
TargetMetabotropic glutamate receptor 1(Homo sapiens (Human))
Yonsei University
Curated by ChEMBL
LigandPNGBDBM50058057(CHEMBL3329236 | US9260448, 2)
Affinity DataIC50:  677nM. Assay description: Antagonist activity at mGluR1 (unknown origin) expressed in Chem-3 cells assessed as inhibition of glutamate-induced increased intracellular calcium ...
In DepthDetails ArticlePubMed
TargetMetabotropic glutamate receptor 1(Homo sapiens (Human))
Yonsei University
Curated by ChEMBL
LigandPNGBDBM50058057(CHEMBL3329236 | US9260448, 2)
Affinity DataIC50:  407nM. Assay description: Cells of Chem3 Cell Line (HTS145C:Millipore) in which mGluR1 was stably expressed were adjusted to a density of 2×106/ml. 50 μl of the cells wer...
In DepthDetails US Patent