BDBM50058319 CHEMBL3331263
SMILES O=c1oc2ccccc2n1CCCCCN1CCN(CC1)c1ccccc1
InChI Key InChIKey=SIAFXZNOSNUNMU-UHFFFAOYSA-N
Data  2 KI
  Tab Delimited (TSV)   2D SDfile   Computed 3D by Vconf -m prep SDfile
Find this compound or compounds like it in BindingDB:
Activity Spreadsheet -- Enzyme Inhibition Constant Data from BindingDB
Found 2 hits for monomerid = 50058319
Target5-hydroxytryptamine receptor 1A(Homo sapiens (Human))
Universit£
Curated by ChEMBL
LigandPNGBDBM50058319(CHEMBL3331263)
Affinity DataKi:  19nM. Assay description: Displacement of [3H]8-OH-DPAT from human 5-HT1A receptor transfected in CFO-K1 cells after 30 mins by liquid scintillation spectrometry
In DepthDetails ArticlePubMed
Target5-hydroxytryptamine receptor 7(Homo sapiens (Human))
Universit£
Curated by ChEMBL
LigandPNGBDBM50058319(CHEMBL3331263)
Affinity DataKi:  57nM. Assay description: Displacement of [3H]5-HT from human 5HT7 receptor transfected in CFO-K1 cells after 30 mins by liquid scintillation spectrometry
In DepthDetails ArticlePubMed