BDBM50058508 CHEMBL3331460
SMILES CC(C)[C@H]1CC[C@H](C)CC1NC(=O)c1nn(c-2c1Cc1sc(C)cc-21)-c1ccc(Cl)cc1Cl
InChI Key InChIKey=SGRLWKHFURODCT-FYNSKXJZSA-N
Data  2 KI
  Tab Delimited (TSV)   2D SDfile   Computed 3D by Vconf -m prep SDfile
Find this compound or compounds like it in BindingDB:
Activity Spreadsheet -- Enzyme Inhibition Constant Data from BindingDB
Found 2 hits for monomerid = 50058508
TargetCannabinoid receptor 2(MOUSE)
Universit£
Curated by ChEMBL
LigandPNGBDBM50058508(CHEMBL3331460)
Affinity DataKi:  5.10nM. Assay description: Displacement of [3H]-CP55940 from CD1 mouse spleen CB2 receptor by liquid scintillation counting
In DepthDetails ArticlePubMed
TargetCannabinoid receptor 1(Mus musculus (Mouse))
Universit£
Curated by ChEMBL
LigandPNGBDBM50058508(CHEMBL3331460)
Affinity DataKi:  6.5nM. Assay description: Displacement of [3H]-CP55940 from CD1 mouse brain (minus cerebellum) CB1 receptor by liquid scintillation counting
In DepthDetails ArticlePubMed