BDBM50059971 2-(3-Fluoro-phenyl)-6-methyl-1H-[1,8]naphthyridin-4-one::2-(3-fluorophenyl)-6-methyl-1,8-naphthyridin-4(1H)-one::CHEMBL48300
SMILES Cc1cnc2nc(cc(O)c2c1)-c1cccc(F)c1
InChI Key InChIKey=AMJPGRQDFBNSON-UHFFFAOYSA-N
Data  2 IC50
  Tab Delimited (TSV)   2D SDfile   Computed 3D by Vconf -m prep SDfile
Find this compound or compounds like it in BindingDB:
Activity Spreadsheet -- Enzyme Inhibition Constant Data from BindingDB
Found 2 hits for monomerid = 50059971
TargetSimilar to alpha-tubulin isoform 1(Bos taurus)
University Of North Carolina
Curated by ChEMBL
LigandPNGBDBM50059971(2-(3-Fluoro-phenyl)-6-methyl-1H-[1,8]naphthyridin-...)
Affinity DataIC50:  630nM. Assay description: Inhibition of tubulin polymerization
In DepthDetails ArticlePubMed
TargetTubulin alpha-1A chain(Sus scrofa (Pig))
University Of North Carolina At Chapel Hill
Curated by ChEMBL
LigandPNGBDBM50059971(2-(3-Fluoro-phenyl)-6-methyl-1H-[1,8]naphthyridin-...)
Affinity DataIC50:  631nM. Assay description: Inhibition of tubulin polymerization interacting at the colchicine binding site
In DepthDetails ArticlePubMed