BDBM50060128 CHEMBL321345::[8-Chloro-2-(4-chloro-phenyl)-6-trifluoromethyl-imidazo[1,2-a]pyridin-3-yl]-acetic acid ethyl ester
SMILES CCOC(=O)Cc1c(nc2c(Cl)cc(cn12)C(F)(F)F)-c1ccc(Cl)cc1
InChI Key InChIKey=XVHAICNXHFWMSC-UHFFFAOYSA-N
Data  1 IC50
  Tab Delimited (TSV)   2D SDfile   Computed 3D by Vconf -m prep SDfile
Find this compound or compounds like it in BindingDB:
Activity Spreadsheet -- Enzyme Inhibition Constant Data from BindingDB
Found 1 hit for monomerid = 50060128
TargetTranslocator protein(Rattus norvegicus (rat))
Universit£
Curated by ChEMBL
LigandPNGBDBM50060128(CHEMBL321345 | [8-Chloro-2-(4-chloro-phenyl)-6-tri...)
Affinity DataIC50: >10nM. Assay description: Displacement of Ro 5-4864 from peripheral (renal cell) Benzodiazepine receptor
In DepthDetails ArticlePubMed