BDBM50060185 (6S,9R,14R,16aS)-9-[(S)-2-Acetylamino-3-(4-hydroxy-phenyl)-propionylamino]-6-methyl-5,8,16-trioxo-tetradecahydro-11,12-dithia-4a,7,15-triaza-benzocyclotetradecene-14-carboxylic acid::CHEMBL432796
SMILES C[C@@H]1NC(=O)[C@H](CSSC[C@H](NC(=O)[C@@H]2CCCCN2C1=O)C(O)=O)NC(=O)[C@H](Cc1ccc(O)cc1)NC(C)=O
InChI Key InChIKey=IUEVXNMBIIQKAS-ZTIIYBLCSA-N
Data  2 IC50
  Tab Delimited (TSV)   2D SDfile   Computed 3D by Vconf -m prep SDfile
Find this compound or compounds like it in BindingDB:
Activity Spreadsheet -- Enzyme Inhibition Constant Data from BindingDB
Found 2 hits for monomerid = 50060185
TargetIntegrin alpha-4/beta-1(Homo sapiens (Human))
Genentech
Curated by ChEMBL
LigandPNGBDBM50060185((6S,9R,14R,16aS)-9-[(S)-2-Acetylamino-3-(4-hydroxy...)
Affinity DataIC50:  1nM. Assay description: Inhibition of purified alpha-4 beta-1 binding to VCAM-1 was determined in an ELISA assay.
In DepthDetails ArticlePubMed
TargetIntegrin alpha-4/beta-1(Homo sapiens (Human))
Genentech
Curated by ChEMBL
LigandPNGBDBM50060185((6S,9R,14R,16aS)-9-[(S)-2-Acetylamino-3-(4-hydroxy...)
Affinity DataIC50:  20nM. Assay description: Inhibition of fluorescently labeled alpha4-beta1 positive Ramos cells binding to immobilized VCAM-1.
In DepthDetails ArticlePubMed