BDBM50060193 (5S,8R,13R,15aS)-8-[(S)-2-Amino-3-(3-fluoro-4-hydroxy-phenyl)-propionylamino]-5-hydroxymethyl-4,7,15-trioxo-tetradecahydro-10,11-dithia-3a,6,14-triaza-cyclopentacyclotetradecene-13-carboxylic acid::CHEMBL432437
SMILES N[C@@H](Cc1ccc(O)c(F)c1)C(=O)N[C@H]1CSSC[C@H](NC(=O)[C@@H]2CCCN2C(=O)[C@H](CO)NC1=O)C(O)=O
InChI Key InChIKey=CPJZBJYUXWZPKN-WOYTXXSLSA-N
Data  2 IC50
  Tab Delimited (TSV)   2D SDfile   Computed 3D by Vconf -m prep SDfile
Find this compound or compounds like it in BindingDB:
Activity Spreadsheet -- Enzyme Inhibition Constant Data from BindingDB
Found 2 hits for monomerid = 50060193
TargetIntegrin alpha-4/beta-1(Homo sapiens (Human))
Genentech
Curated by ChEMBL
LigandPNGBDBM50060193((5S,8R,13R,15aS)-8-[(S)-2-Amino-3-(3-fluoro-4-hydr...)
Affinity DataIC50:  8nM. Assay description: Inhibition of purified alpha-4 beta-1 binding to VCAM-1 was determined in an ELISA assay.
In DepthDetails ArticlePubMed
TargetIntegrin alpha-4/beta-1(Homo sapiens (Human))
Genentech
Curated by ChEMBL
LigandPNGBDBM50060193((5S,8R,13R,15aS)-8-[(S)-2-Amino-3-(3-fluoro-4-hydr...)
Affinity DataIC50:  500nM. Assay description: Inhibition of fluorescently labeled alpha4-beta1 positive Ramos cells binding to immobilized VCAM-1.
In DepthDetails ArticlePubMed