BDBM50060235 (5S,8R,13R,15aS)-8-Benzoylamino-5-hydroxymethyl-4,7,15-trioxo-tetradecahydro-10,11-dithia-3a,6,14-triaza-cyclopentacyclotetradecene-13-carboxylic acid::CHEMBL325911
SMILES OC[C@@H]1NC(=O)[C@H](CSSC[C@H](NC(=O)[C@@H]2CCCN2C1=O)C(O)=O)NC(=O)c1ccccc1
InChI Key InChIKey=BHZFFFDMZBHXBW-VGWMRTNUSA-N
Data  2 IC50
  Tab Delimited (TSV)   2D SDfile   Computed 3D by Vconf -m prep SDfile
Find this compound or compounds like it in BindingDB:
Activity Spreadsheet -- Enzyme Inhibition Constant Data from BindingDB
Found 2 hits for monomerid = 50060235
TargetIntegrin alpha-4/beta-1(Homo sapiens (Human))
Genentech
Curated by ChEMBL
LigandPNGBDBM50060235((5S,8R,13R,15aS)-8-Benzoylamino-5-hydroxymethyl-4,...)
Affinity DataIC50:  1.90E+3nM. Assay description: Inhibition of fluorescently labeled alpha4-beta1 positive Ramos cells binding to immobilized VCAM-1.
In DepthDetails ArticlePubMed
TargetIntegrin alpha-4/beta-1(Homo sapiens (Human))
Genentech
Curated by ChEMBL
LigandPNGBDBM50060235((5S,8R,13R,15aS)-8-Benzoylamino-5-hydroxymethyl-4,...)
Affinity DataIC50:  134nM. Assay description: Inhibition of purified alpha-4 beta-1 binding to VCAM-1 was determined in an ELISA assay.
In DepthDetails ArticlePubMed