BDBM50060464 (+) 7-[3-(Biphenyl-4-sulfonylamino)-bicyclo[2.2.1]hept-2-yl]-hept-5-enoic acid::(Z)-7-[(1S,2R,3R,4R)-3-(Biphenyl-4-sulfonylamino)-bicyclo[2.2.1]hept-2-yl]-hept-5-enoic acid::CHEMBL79511
SMILES OC(=O)CCC\C=C/C[C@@H]1[C@H]2CC[C@H](C2)[C@H]1NS(=O)(=O)c1ccc(cc1)-c1ccccc1
InChI Key InChIKey=NKFFKDVJGSLYGD-QIXBOIAMSA-N
Data  6 IC50
  Tab Delimited (TSV)   2D SDfile   Computed 3D by Vconf -m prep SDfile
Find this compound or compounds like it in BindingDB:
Activity Spreadsheet -- Enzyme Inhibition Constant Data from BindingDB
Found 6 hits for monomerid = 50060464
TargetProstaglandin D2 receptor(Homo sapiens (Human))
Shionogi
Curated by ChEMBL
LigandPNGBDBM50060464((+) 7-[3-(Biphenyl-4-sulfonylamino)-bicyclo[2.2.1]...)
Affinity DataIC50:  600nM. Assay description: Inhibition of [3H]-PGD-2 specific binding to Prostaglandin D2 receptor fromhuman platelet membranes
In DepthDetails ArticlePubMed
TargetProstacyclin receptor(Homo sapiens (Human))
Shionogi
Curated by ChEMBL
LigandPNGBDBM50060464((+) 7-[3-(Biphenyl-4-sulfonylamino)-bicyclo[2.2.1]...)
Affinity DataIC50:  5.00E+3nM. Assay description: Inhibition of cAMP formation by carbacyclin in Prostaglandin I2 receptor (IP) assay
In DepthDetails ArticlePubMed
TargetProstaglandin D2 receptor(Homo sapiens (Human))
Shionogi
Curated by ChEMBL
LigandPNGBDBM50060464((+) 7-[3-(Biphenyl-4-sulfonylamino)-bicyclo[2.2.1]...)
Affinity DataIC50:  450nM. Assay description: In vitro inhibition of cAMP formation evoked by prostaglandin D2 receptor in human platelets
In DepthDetails ArticlePubMed
TargetThromboxane A2 receptor(Homo sapiens (Human))
Shionogi
Curated by ChEMBL
LigandPNGBDBM50060464((+) 7-[3-(Biphenyl-4-sulfonylamino)-bicyclo[2.2.1]...)
Affinity DataIC50:  1.10E+3nM. Assay description: Inhibition of [3H]- (+)-S-145 specific binding to human platelet membranes in TXA2 receptor (TP) assay
In DepthDetails ArticlePubMed
TargetProstaglandin D2 receptor(Homo sapiens (Human))
Shionogi
Curated by ChEMBL
LigandPNGBDBM50060464((+) 7-[3-(Biphenyl-4-sulfonylamino)-bicyclo[2.2.1]...)
Affinity DataIC50:  600nM. Assay description: In vitro inhibition of [3H]- PGD-2 radioligand binding to prostaglandin D2 receptor on human platelet membrane
In DepthDetails ArticlePubMed
TargetProstaglandin D2 receptor(Homo sapiens (Human))
Shionogi
Curated by ChEMBL
LigandPNGBDBM50060464((+) 7-[3-(Biphenyl-4-sulfonylamino)-bicyclo[2.2.1]...)
Affinity DataIC50:  450nM. Assay description: Inhibition of cAMP formation evoked by the prostaglandin D2 receptor in human platelets
In DepthDetails ArticlePubMed