BDBM50061028 (S)-1-[(S)-2-(4-Methoxy-benzoylamino)-3-methyl-butyryl]-pyrrolidine-2-carboxylic acid ((S)-4-benzylamino-3,3-difluoro-1-isopropyl-2-oxo-butyl)-amide::CHEMBL110443::CHEMBL432539
SMILES COc1ccc(cc1)C(=O)N[C@@H](C(C)C)C(=O)N1CCC[C@H]1C(=O)N[C@@H](C(C)C)C(=O)C(F)(F)CNCc1ccccc1
InChI Key InChIKey=KJYLKYPXNIJZLI-QKDODKLFSA-N
Data  2 KI
  Tab Delimited (TSV)   2D SDfile   Computed 3D by Vconf -m prep SDfile
Find this compound or compounds like it in BindingDB:
Activity Spreadsheet -- Enzyme Inhibition Constant Data from BindingDB
Found 1 hit for monomerid = 50061028
TargetNeutrophil elastase(Homo sapiens (Human))
TBA
Curated by ChEMBL
LigandPNGBDBM50061028((S)-1-[(S)-2-(4-Methoxy-benzoylamino)-3-methyl-but...)
Affinity DataKi:  0.350nM. Assay description: In vitro inhibitory activity against human leukocyte elastase was determined
In DepthDetails Article