BDBM50062039 3,5-Bis-(3-carbamimidoyl-phenyl)-pentanoic acid methyl ester::CHEMBL156367
SMILES COC(=O)CC(CCc1cccc(c1)C(N)=N)c1cccc(c1)C(N)=N
InChI Key InChIKey=BJHNYPYYKUGEQS-UHFFFAOYSA-N
Data  2 KI
  Tab Delimited (TSV)   2D SDfile   Computed 3D by Vconf -m prep SDfile
Find this compound or compounds like it in BindingDB:
Activity Spreadsheet -- Enzyme Inhibition Constant Data from BindingDB
Found 2 hits for monomerid = 50062039
TargetCoagulation factor X(Homo sapiens (Human))
Dupont Pharmaceuticals
Curated by ChEMBL
LigandPNGBDBM50062039(3,5-Bis-(3-carbamimidoyl-phenyl)-pentanoic acid me...)
Affinity DataKi:  2.80E+3nM. Assay description: In vitro inhibition of Coagulation factor X
In DepthDetails ArticlePubMed
TargetProthrombin(Homo sapiens (Human))
Dupont Pharmaceuticals
Curated by ChEMBL
LigandPNGBDBM50062039(3,5-Bis-(3-carbamimidoyl-phenyl)-pentanoic acid me...)
Affinity DataKi:  8.50E+3nM. Assay description: In vitro inhibition of thrombin
In DepthDetails ArticlePubMed