BDBM50062613 17-methyl-(1S,9S,10S)-17-azatetracyclo[7.5.3.01,10.02,7]heptadeca-2(7),3,5-trien-5-ol::CHEMBL341216::DEXTRORPHAN
SMILES CN1CC[C@@]23CCCC[C@@H]2[C@@H]1Cc1cc(O)ccc31
InChI Key InChIKey=OEGSSWBTYVPHRM-IXDOHACOSA-N
Data  1 KI  1 IC50
  Tab Delimited (TSV)   2D SDfile   Computed 3D by Vconf -m prep SDfile
Find this compound or compounds like it in BindingDB:
Activity Spreadsheet -- Enzyme Inhibition Constant Data from BindingDB
Found 2 hits for monomerid = 50062613
TargetAcetylcholinesterase(Electrophorus electricus (Electric eel))
University Of Innsbruck And Center For Molecular Biosciences Innsbruck-Cmbi
Curated by ChEMBL
LigandPNGBDBM50062613(17-methyl-(1S,9S,10S)-17-azatetracyclo[7.5.3.01,10...)
Affinity DataKi:  2.00E+4nM. Assay description: Inhibition of electric eel AChE by Ellman's method
In DepthDetails ArticlePubMed
TargetGlutamate receptor ionotropic, NMDA 1(Homo sapiens (Human))
Medical University Of Lublin
Curated by ChEMBL
LigandPNGBDBM50062613(17-methyl-(1S,9S,10S)-17-azatetracyclo[7.5.3.01,10...)
Affinity DataIC50:  246nMpH: 6.9Assay Description:Antagonist activity at NR1/2B receptor (unknown origin) expressed in xenopus laevis at pH 6.9 by two electrode voltage clamp method
In DepthDetails ArticlePubMed