BDBM50062683 (E)-2-(3-Carbamimidoyl-benzyl)-3-[(3'-methyl-biphenyl-4-carbonyl)-amino]-5-phenyl-pent-4-enoic acid methyl ester::CHEMBL341997
SMILES COC(=O)C(Cc1cccc(c1)C(N)=N)C(NC(=O)c1ccc(cc1)-c1cccc(C)c1)\C=C\c1ccccc1
InChI Key InChIKey=JVEIHEXJFKDWES-XMHGGMMESA-N
Data  3 IC50
  Tab Delimited (TSV)   2D SDfile   Computed 3D by Vconf -m prep SDfile
Find this compound or compounds like it in BindingDB:
Activity Spreadsheet -- Enzyme Inhibition Constant Data from BindingDB
Found 3 hits for monomerid = 50062683
TargetProthrombin(Homo sapiens (Human))
Collegeville
Curated by ChEMBL
LigandPNGBDBM50062683((E)-2-(3-Carbamimidoyl-benzyl)-3-[(3'-methyl-biphe...)
Affinity DataIC50:  7.20E+3nM. Assay description: Inhibitory activity against human Thrombin
In DepthDetails ArticlePubMed
TargetCoagulation factor X(Homo sapiens (Human))
Collegeville
Curated by ChEMBL
LigandPNGBDBM50062683((E)-2-(3-Carbamimidoyl-benzyl)-3-[(3'-methyl-biphe...)
Affinity DataIC50:  120nM. Assay description: Inhibitory activity against human Coagulation factor X
In DepthDetails ArticlePubMed
TargetSerine protease 1/Trypsin-2(Homo sapiens (Human))
Collegeville
Curated by ChEMBL
LigandPNGBDBM50062683((E)-2-(3-Carbamimidoyl-benzyl)-3-[(3'-methyl-biphe...)
Affinity DataIC50:  2.70E+3nM. Assay description: Inhibitory activity against bovine trypsin
In DepthDetails ArticlePubMed