BDBM50062688 (E)-2-(3-Carbamimidoyl-benzyl)-3-[(3'-ethoxy-biphenyl-4-carbonyl)-amino]-5-phenyl-pent-4-enoic acid methyl ester::CHEMBL139810
SMILES CCOc1cccc(c1)-c1ccc(cc1)C(=O)NC(\C=C\c1ccccc1)C(Cc1cccc(c1)C(N)=N)C(=O)OC
InChI Key InChIKey=PPBGNSZPDCEZLQ-HMMYKYKNSA-N
Data  3 IC50
  Tab Delimited (TSV)   2D SDfile   Computed 3D by Vconf -m prep SDfile
Find this compound or compounds like it in BindingDB:
Activity Spreadsheet -- Enzyme Inhibition Constant Data from BindingDB
Found 3 hits for monomerid = 50062688
TargetCoagulation factor X(Homo sapiens (Human))
Collegeville
Curated by ChEMBL
LigandPNGBDBM50062688((E)-2-(3-Carbamimidoyl-benzyl)-3-[(3'-ethoxy-biphe...)
Affinity DataIC50:  180nM. Assay description: Inhibitory activity against human Coagulation factor X
In DepthDetails ArticlePubMed
TargetSerine protease 1/Trypsin-2(Homo sapiens (Human))
Collegeville
Curated by ChEMBL
LigandPNGBDBM50062688((E)-2-(3-Carbamimidoyl-benzyl)-3-[(3'-ethoxy-biphe...)
Affinity DataIC50:  3.60E+3nM. Assay description: Inhibitory activity against bovine trypsin
In DepthDetails ArticlePubMed
TargetProthrombin(Homo sapiens (Human))
Collegeville
Curated by ChEMBL
LigandPNGBDBM50062688((E)-2-(3-Carbamimidoyl-benzyl)-3-[(3'-ethoxy-biphe...)
Affinity DataIC50:  4.30E+3nM. Assay description: Inhibitory activity against human Thrombin
In DepthDetails ArticlePubMed