BDBM50062707 (E)-2-(3-Carbamimidoyl-benzyl)-3-[(naphthalene-1-carbonyl)-amino]-5-phenyl-pent-4-enoic acid methyl ester::CHEMBL344205
SMILES COC(=O)C(Cc1cccc(c1)C(N)=N)C(NC(=O)c1cccc2ccccc12)\C=C\c1ccccc1
InChI Key InChIKey=ICPWQNURJPTVSL-ISLYRVAYSA-N
Data  1 IC50
  Tab Delimited (TSV)   2D SDfile   Computed 3D by Vconf -m prep SDfile
Find this compound or compounds like it in BindingDB:
Activity Spreadsheet -- Enzyme Inhibition Constant Data from BindingDB
Found 1 hit for monomerid = 50062707
TargetCoagulation factor X(Homo sapiens (Human))
Collegeville
Curated by ChEMBL
LigandPNGBDBM50062707((E)-2-(3-Carbamimidoyl-benzyl)-3-[(naphthalene-1-c...)
Affinity DataIC50:  790nM. Assay description: Inhibitory activity against human Coagulation factor X
In DepthDetails ArticlePubMed