BDBM50062845 2,2-Dimethyl-3-(3,7,12,20-tetramethyl-16-vinyl-henicosa-3,7,11,19-tetraenyl)-oxirane::CHEMBL152272
SMILES [#6]\[#6](-[#6])=[#6]\[#6]-[#6]-[#6](-[#6]-[#6]-[#6]-[#6](-[#6])=[#6]-[#6]-[#6]-[#6]=[#6](-[#6])-[#6]-[#6]-[#6]=[#6](-[#6])-[#6]-[#6]-[#6]1-[#8]C1([#6])[#6])-[#6]=[#6]
InChI Key InChIKey=UUGQMKYXGCLAAV-QPLQFNRHSA-N
Data  2 IC50
  Tab Delimited (TSV)   2D SDfile   Computed 3D by Vconf -m prep SDfile
Find this compound or compounds like it in BindingDB:
Activity Spreadsheet -- Enzyme Inhibition Constant Data from BindingDB
Found 2 hits for monomerid = 50062845
TargetLanosterol synthase(Homo sapiens (Human))
Università
Curated by ChEMBL
LigandPNGBDBM50062845(2,2-Dimethyl-3-(3,7,12,20-tetramethyl-16-vinyl-hen...)
Affinity DataIC50: >1.00E+5nM. Assay description: Compound was tested for inhibition of solubilized and partially purified Saccharomyces cerevisae Oxidosqualene-lanosterol cyclase
In DepthDetails ArticlePubMed
TargetLanosterol synthase(Rattus norvegicus)
Università
Curated by ChEMBL
LigandPNGBDBM50062845(2,2-Dimethyl-3-(3,7,12,20-tetramethyl-16-vinyl-hen...)
Affinity DataIC50:  1.00E+5nM. Assay description: Compound was tested for inhibition of solubilized and partially purified pig liver Oxidosqualene-lanosterol cyclase
In DepthDetails ArticlePubMed