BDBM50063486 CHEMBL3398449
SMILES Cc1oc(nc1CCOc1ccc(C[C@@H]2CN(C[C@@H]2C(O)=O)c2nccc(C)n2)cc1)-c1ccccc1
InChI Key InChIKey=HUAMACBYFQRBSO-NOZRDPDXSA-N
Data  2 IC50  2 EC50
  Tab Delimited (TSV)   2D SDfile   Computed 3D by Vconf -m prep SDfile
Find this compound or compounds like it in BindingDB:
Activity Spreadsheet -- Enzyme Inhibition Constant Data from BindingDB
Found 4 hits for monomerid = 50063486
TargetPeroxisome proliferator-activated receptor alpha(Homo sapiens (Human))
Bristol-Myers Squibb Research And Development (R & D)
Curated by ChEMBL
LigandPNGBDBM50063486(CHEMBL3398449)
Affinity DataEC50:  170nM. Assay description: Agonist activity at GAL4 tagged human PPARalpha ligand binding domain expressed in HEK293 cells by luciferase reporter gene assay
In DepthDetails ArticlePubMed
TargetPeroxisome proliferator-activated receptor alpha(Homo sapiens (Human))
Bristol-Myers Squibb Research And Development (R & D)
Curated by ChEMBL
LigandPNGBDBM50063486(CHEMBL3398449)
Affinity DataIC50:  3.98E+3nM. Assay description: Binding affinity to PPARalpha (unknown origin) using fluorescein-tagged dual PPARalpha/gamma activator by homogeneous fluorescence polarization bindi...
In DepthDetails ArticlePubMed
TargetPeroxisome proliferator-activated receptor gamma(Homo sapiens (Human))
Bristol-Myers Squibb Research And Development (R & D)
Curated by ChEMBL
LigandPNGBDBM50063486(CHEMBL3398449)
Affinity DataEC50:  630nM. Assay description: Agonist activity at GAL4 tagged human PPARgamma ligand binding domain expressed in HEK293 cells by luciferase reporter gene assay
In DepthDetails ArticlePubMed
TargetPeroxisome proliferator-activated receptor gamma(Homo sapiens (Human))
Bristol-Myers Squibb Research And Development (R & D)
Curated by ChEMBL
LigandPNGBDBM50063486(CHEMBL3398449)
Affinity DataIC50:  450nM. Assay description: Binding affinity to PPARgamma (unknown origin) using fluorescein-tagged dual PPARalpha/gamma activator by homogeneous fluorescence polarization bindi...
In DepthDetails ArticlePubMed