BDBM50063488 CHEMBL3398452
SMILES Cc1oc(nc1CCOc1ccc(C[C@@H]2CN(C[C@H]2C(O)=O)c2nccc(n2)C(F)(F)F)cc1)-c1ccccc1
InChI Key InChIKey=ABIFPJDABNXEMK-FYYLOGMGSA-N
Data  2 IC50  2 EC50
  Tab Delimited (TSV)   2D SDfile   Computed 3D by Vconf -m prep SDfile
Find this compound or compounds like it in BindingDB:
Activity Spreadsheet -- Enzyme Inhibition Constant Data from BindingDB
Found 4 hits for monomerid = 50063488
TargetPeroxisome proliferator-activated receptor alpha(Homo sapiens (Human))
Bristol-Myers Squibb Research And Development (R & D)
Curated by ChEMBL
LigandPNGBDBM50063488(CHEMBL3398452)
Affinity DataEC50:  4.41E+3nM. Assay description: Agonist activity at GAL4 tagged human PPARalpha ligand binding domain expressed in HEK293 cells by luciferase reporter gene assay
In DepthDetails ArticlePubMed
TargetPeroxisome proliferator-activated receptor alpha(Homo sapiens (Human))
Bristol-Myers Squibb Research And Development (R & D)
Curated by ChEMBL
LigandPNGBDBM50063488(CHEMBL3398452)
Affinity DataIC50: >5.00E+4nM. Assay description: Binding affinity to PPARalpha (unknown origin) using fluorescein-tagged dual PPARalpha/gamma activator by homogeneous fluorescence polarization bindi...
In DepthDetails ArticlePubMed
TargetPeroxisome proliferator-activated receptor gamma(Homo sapiens (Human))
Bristol-Myers Squibb Research And Development (R & D)
Curated by ChEMBL
LigandPNGBDBM50063488(CHEMBL3398452)
Affinity DataIC50:  1.16E+3nM. Assay description: Binding affinity to PPARgamma (unknown origin) using fluorescein-tagged dual PPARalpha/gamma activator by homogeneous fluorescence polarization bindi...
In DepthDetails ArticlePubMed
TargetPeroxisome proliferator-activated receptor gamma(Homo sapiens (Human))
Bristol-Myers Squibb Research And Development (R & D)
Curated by ChEMBL
LigandPNGBDBM50063488(CHEMBL3398452)
Affinity DataEC50: >3.00E+4nM. Assay description: Agonist activity at GAL4 tagged human PPARgamma ligand binding domain expressed in HEK293 cells by luciferase reporter gene assay
In DepthDetails ArticlePubMed