BDBM50064263 CHEMBL3403663
SMILES [Na+].C[C@@]12CCC(=O)c3coc(c13)C(=O)c1cc3cccc(OS([O-])(=O)=O)c3cc21
InChI Key InChIKey=OXHWTQBCGLHGQP-BDQAORGHSA-M
Data  1 IC50
  Tab Delimited (TSV)   2D SDfile   Computed 3D by Vconf -m prep SDfile
Find this compound or compounds like it in BindingDB:
Activity Spreadsheet -- Enzyme Inhibition Constant Data from BindingDB
Found 1 hit for monomerid = 50064263
TargetCystathionine beta-synthase(Homo sapiens (Human))
University Of Utah
Curated by ChEMBL
LigandPNGBDBM50064263(CHEMBL3403663)
Affinity DataIC50:  1.36E+5nM. Assay description: Inhibition of full-length wild-type cystathionine beta-synthase (unknown origin) assessed as inhibition of H2S production by fluorescence assay in pr...
In DepthDetails ArticlePubMed