BDBM50064838 CHEMBL267152::Y-c[Pen-(2')Nal-GSFC]KK-NH2
SMILES CC1(C)SSC[C@@H](NC(=O)[C@@H](Cc2ccccc2)NC(=O)[C@H](CO)NC(=O)CNC(=O)[C@H](Cc2ccc3ccccc3c2)NC(=O)[C@H]1NC(=O)[C@@H](N)Cc1ccc(O)cc1)C(=O)N[C@@H](CCCCN)C(=O)N[C@@H](CCCCN)C(N)=O
InChI Key InChIKey=IREGTTSUCNOKNE-KGFXBMCJSA-N
Data  1 IC50
  Tab Delimited (TSV)   2D SDfile   Computed 3D by Vconf -m prep SDfile
Find this compound or compounds like it in BindingDB:
Activity Spreadsheet -- Enzyme Inhibition Constant Data from BindingDB
Found 1 hit for monomerid = 50064838
TargetProto-oncogene tyrosine-protein kinase Src(Homo sapiens (Human))
University Of Arizona
Curated by ChEMBL
LigandPNGBDBM50064838(CHEMBL267152 | Y-c[Pen-(2')Nal-GSFC]KK-NH2)
Affinity DataIC50:  2.00E+3nM. Assay description: Inhibition of c-Src tyrosine kinase.
In DepthDetails ArticlePubMed