BDBM50065342 (1S,4aS,5R)-1,4a-Dimethyl-6-oxo-5-[2-(2-oxo-tetrahydro-furan-3-yl)-ethyl]-decahydro-naphthalene-1-carboxylic acid methyl ester::CHEMBL430638
SMILES COC(=O)[C@@]1(C)CCC[C@]2(C)[C@@H](CCC3CCOC3=O)C(=O)CCC12
InChI Key InChIKey=VYGRJLSEKZYMAS-VFVAGYGPSA-N
Data  1 IC50
  Tab Delimited (TSV)   2D SDfile   Computed 3D by Vconf -m prep SDfile
Find this compound or compounds like it in BindingDB:
Activity Spreadsheet -- Enzyme Inhibition Constant Data from BindingDB
Found 1 hit for monomerid = 50065342
TargetPlatelet-activating factor receptor(Cavia porcellus)
Seoul National University
Curated by ChEMBL
LigandPNGBDBM50065342((1S,4aS,5R)-1,4a-Dimethyl-6-oxo-5-[2-(2-oxo-tetrah...)
Affinity DataIC50:  2.60E+3nM. Assay description: In vitro inhibitory activity against PAF receptor using [3H]-PAF as radioligand in rabbit platelets
In DepthDetails ArticlePubMed