BDBM50065348 (1S,4aR,5S)-1,4a-Dimethyl-6-methylene-5-[2-(2-oxo-2,5-dihydro-furan-3-yl)-ethyl]-decahydro-naphthalene-1-carboxylic acid methyl ester::CHEMBL90271
SMILES COC(=O)[C@@]1(C)CCC[C@]2(C)[C@@H](CCC3=CCOC3=O)C(=C)CCC12
InChI Key InChIKey=WTKBZJAWPZXKJU-MSLCQOBGSA-N
Data  1 IC50
  Tab Delimited (TSV)   2D SDfile   Computed 3D by Vconf -m prep SDfile
Find this compound or compounds like it in BindingDB:
Activity Spreadsheet -- Enzyme Inhibition Constant Data from BindingDB
Found 1 hit for monomerid = 50065348
TargetPlatelet-activating factor receptor(Cavia porcellus)
Seoul National University
Curated by ChEMBL
LigandPNGBDBM50065348((1S,4aR,5S)-1,4a-Dimethyl-6-methylene-5-[2-(2-oxo-...)
Affinity DataIC50:  250nM. Assay description: In vitro inhibitory activity against PAF receptor using [3H]-PAF as radioligand in rabbit platelets
In DepthDetails ArticlePubMed