BDBM50066085 CHEMBL3402933
SMILES NC(=O)c1cc(sc1NC(=O)Nc1ccccc1)-c1ccccc1
InChI Key InChIKey=BUXDTSRFPFRDFF-UHFFFAOYSA-N
Data  1 IC50
  Tab Delimited (TSV)   2D SDfile   Computed 3D by Vconf -m prep SDfile
Find this compound or compounds like it in BindingDB:
Activity Spreadsheet -- Enzyme Inhibition Constant Data from BindingDB
Found 1 hit for monomerid = 50066085
TargetDNA gyrase subunit B(Mycobacterium smegmatis)
Birla Institute Of Technology
Curated by ChEMBL
LigandPNGBDBM50066085(CHEMBL3402933)
Affinity DataIC50:  1.83E+3nMT: 2°C. Assay description: Inhibition of Mycobacterium smegmatis DNA GyrB domain assessed as inhibition of inorganic phosphate release after 100 mins at room temperature by ATP...
In DepthDetails ArticlePubMed