BDBM50066095 CHEMBL3402941
SMILES NC(=O)c1cc(sc1NC(=S)Nc1ccccc1)-c1ccccc1
InChI Key InChIKey=YZNFQZMFJZGPRM-UHFFFAOYSA-N
Data  1 IC50
  Tab Delimited (TSV)   2D SDfile   Computed 3D by Vconf -m prep SDfile
Find this compound or compounds like it in BindingDB:
Activity Spreadsheet -- Enzyme Inhibition Constant Data from BindingDB
Found 1 hit for monomerid = 50066095
TargetDNA gyrase subunit B(Mycobacterium smegmatis)
Birla Institute Of Technology
Curated by ChEMBL
LigandPNGBDBM50066095(CHEMBL3402941)
Affinity DataIC50:  7.03E+4nMT: 2°C. Assay description: Inhibition of Mycobacterium smegmatis DNA GyrB domain assessed as inhibition of inorganic phosphate release after 100 mins at room temperature by ATP...
In DepthDetails ArticlePubMed