BDBM50066431 ((S)-3-Methoxy-4-octadecyloxy-butyl)-phosphonic acid mono-(2,3,4,6-tetrahydroxy-cyclohexyl) ester::CHEMBL112635
SMILES CCCCCCCCCCCCCCCCCCOC[C@H](CCP(O)(=O)OC1C(O)CC(O)C(O)C1O)OC
InChI Key InChIKey=QRWNOVRSKZMLCK-NMMSVJGSSA-N
Data  1 IC50
  Tab Delimited (TSV)   2D SDfile   Computed 3D by Vconf -m prep SDfile
Find this compound or compounds like it in BindingDB:
Activity Spreadsheet -- Enzyme Inhibition Constant Data from BindingDB
Found 1 hit for monomerid = 50066431
Target1-phosphatidylinositol 4,5-bisphosphate phosphodiesterase gamma-2(Homo sapiens (Human))
Georgetown University Medical Center
Curated by ChEMBL
LigandPNGBDBM50066431(((S)-3-Methoxy-4-octadecyloxy-butyl)-phosphonic ac...)
Affinity DataIC50:  1.00E+4nM. Assay description: In vitro inhibitory activity against bovine Phosphoinositide specific phospholipase C (PI-PLC)
In DepthDetails ArticlePubMed