BDBM50066550 (1S,2R)-2-(1-Amino-prop-2-ynyl)-1-phenyl-cyclopropanecarboxylic acid diethylamide::CHEMBL326735
SMILES CCN(CC)C(=O)[C@]1(C[C@H]1C(N)C#C)c1ccccc1
InChI Key InChIKey=KVSRHZKOXHLCCI-XJIUDMAQSA-N
Data  2 KI
  Tab Delimited (TSV)   2D SDfile   Computed 3D by Vconf -m prep SDfile
Find this compound or compounds like it in BindingDB:
Activity Spreadsheet -- Enzyme Inhibition Constant Data from BindingDB
Found 2 hits for monomerid = 50066550
TargetSodium-dependent serotonin transporter(Rattus norvegicus (rat))
Hokkaido University
Curated by ChEMBL
LigandPNGBDBM50066550((1S,2R)-2-(1-Amino-prop-2-ynyl)-1-phenyl-cycloprop...)
Affinity DataKi:  190nM. Assay description: Inhibition of Serotonin transporter in cerebral cortical synaptic membrane of rats using [3H]-paroxetine
In DepthDetails ArticlePubMed
TargetSodium-dependent serotonin transporter(Rattus norvegicus (rat))
Hokkaido University
Curated by ChEMBL
LigandPNGBDBM50066550((1S,2R)-2-(1-Amino-prop-2-ynyl)-1-phenyl-cycloprop...)
Affinity DataKi:  190nM. Assay description: Inhibition of Serotonin transporter in cerebral cortical synaptic membrane of rats using [3H]-paroxetine
In DepthDetails ArticlePubMed