BDBM50067566 (S)-2-{[2'-Ethyl-5-(pyridin-3-yloxymethyl)-biphenyl-2-carbonyl]-amino}-4-methylsulfanyl-butyric acid::CHEMBL134396
SMILES CCc1ccccc1-c1cc(COc2cccnc2)ccc1C(=O)N[C@@H](CCSC)C(O)=O
InChI Key InChIKey=QNAFAZZAFRTFMZ-DEOSSOPVSA-N
Data  1 IC50
  Tab Delimited (TSV)   2D SDfile   Computed 3D by Vconf -m prep SDfile
Find this compound or compounds like it in BindingDB:
Activity Spreadsheet -- Enzyme Inhibition Constant Data from BindingDB
Found 1 hit for monomerid = 50067566
LigandPNGBDBM50067566((S)-2-{[2'-Ethyl-5-(pyridin-3-yloxymethyl)-bipheny...)
Affinity DataIC50:  0.350nM. Assay description: In vitro inhibition of farnesyltransferase from bovine brain
In DepthDetails ArticlePubMed