BDBM50068987 CHEMBL175119::N-[3-(7-Chloro-quinolin-2-ylmethoxy)-phenyl]-2,2-diethyl-succinamic acid
SMILES CCC(CC)(CC(=O)Nc1cccc(OCc2ccc3ccc(Cl)cc3n2)c1)C(O)=O
InChI Key InChIKey=NONOYDRCZAMJOK-UHFFFAOYSA-N
Data  2 IC50
  Tab Delimited (TSV)   2D SDfile   Computed 3D by Vconf -m prep SDfile
Find this compound or compounds like it in BindingDB:
Activity Spreadsheet -- Enzyme Inhibition Constant Data from BindingDB
Found 2 hits for monomerid = 50068987
TargetCysteinyl leukotriene receptor 1/2(Homo sapiens (Human))
Novartis Pharma
Curated by ChEMBL
LigandPNGBDBM50068987(CHEMBL175119 | N-[3-(7-Chloro-quinolin-2-ylmethoxy...)
Affinity DataIC50:  0.800nM. Assay description: In vitro for antagonistic activity against LTD4 receptor in guinea pig ileum
In DepthDetails ArticlePubMed
TargetCysteinyl leukotriene receptor 1(GUINEA PIG)
Novartis Pharma
Curated by ChEMBL
LigandPNGBDBM50068987(CHEMBL175119 | N-[3-(7-Chloro-quinolin-2-ylmethoxy...)
Affinity DataIC50:  64nM. Assay description: Compound was evaluated in vitro for inhibition of [3H]-LTD4 binding to guinea pig lung membrane
In DepthDetails ArticlePubMed