BDBM50069358 CHEMBL3402478
SMILES Cc1ccc(Cl)cc1-n1cc(cn1)-c1ccnc(N)n1
InChI Key InChIKey=DLPCWTIWHXSRCV-UHFFFAOYSA-N
Data  1 IC50
  Tab Delimited (TSV)   2D SDfile   Computed 3D by Vconf -m prep SDfile
Find this compound or compounds like it in BindingDB:
Activity Spreadsheet -- Enzyme Inhibition Constant Data from BindingDB
Found 1 hit for monomerid = 50069358
TargetTyrosine-protein kinase JAK2(Homo sapiens (Human))
Nerviano Medical Sciences
Curated by ChEMBL
LigandPNGBDBM50069358(CHEMBL3402478)
Affinity DataIC50:  950nM. Assay description: Inhibition of recombinant epitope-tagged JAK2 (808 to 1132) (unknown origin) using LPLDKDYYVVREPGQ as substrate by beta-countiing analysis in presenc...
In DepthDetails ArticlePubMed