BDBM50070138 4-{(S)-2-Hydroxy-3-[(S)-3-(4-methoxy-phenyl)-1-methyl-propylamino]-propoxy}-phenol::CHEMBL274782
SMILES COc1ccc(CC[C@H](C)NC[C@H](O)COc2ccc(O)cc2)cc1
InChI Key InChIKey=FVXAAPNMRWHMJD-YJBOKZPZSA-N
Data  2 IC50  1 EC50
  Tab Delimited (TSV)   2D SDfile   Computed 3D by Vconf -m prep SDfile
Find this compound or compounds like it in BindingDB:
Activity Spreadsheet -- Enzyme Inhibition Constant Data from BindingDB
Found 3 hits for monomerid = 50070138
TargetBeta-2 adrenergic receptor(Homo sapiens (Human))
Merck Research Laboratories
Curated by ChEMBL
LigandPNGBDBM50070138(4-{(S)-2-Hydroxy-3-[(S)-3-(4-methoxy-phenyl)-1-met...)
Affinity DataIC50:  20nM. Assay description: Binding affinity against cloned human beta-2 adrenergic receptor from CHO cells using [125I]-iodocyanopindolol as the radioligand
In DepthDetails ArticlePubMed
TargetBeta-1 adrenergic receptor(Homo sapiens (Human))
Merck Research Laboratories
Curated by ChEMBL
LigandPNGBDBM50070138(4-{(S)-2-Hydroxy-3-[(S)-3-(4-methoxy-phenyl)-1-met...)
Affinity DataIC50:  10nM. Assay description: Compound was tested for binding affinity against cloned human beta-1 adrenergic receptor from CHO cells using [125I]-iodocyanopindolol as radioligand
In DepthDetails ArticlePubMed
TargetBeta-3 adrenergic receptor(Homo sapiens (Human))
Merck Research Laboratories
Curated by ChEMBL
LigandPNGBDBM50070138(4-{(S)-2-Hydroxy-3-[(S)-3-(4-methoxy-phenyl)-1-met...)
Affinity DataEC50:  200nM. Assay description: Agonist activity against cloned human beta-3 adrenergic receptor
In DepthDetails ArticlePubMed