BDBM50070544 (S)-2-({(S)-2-[(S)-2-Amino-3-(1H-indol-3-yl)-propionyl]-1,2,3,4-tetrahydro-isoquinoline-3-carbonyl}-amino)-3-hydroxy-propionic acid::CHEMBL432081
SMILES N[C@@H](Cc1c[nH]c2ccccc12)C(=O)N1Cc2ccccc2C[C@H]1C(=O)N[C@@H](CO)C(O)=O
InChI Key InChIKey=MQUPYBNEHBXUCU-JBACZVJFSA-N
Data  1 IC50
  Tab Delimited (TSV)   2D SDfile   Computed 3D by Vconf -m prep SDfile
Find this compound or compounds like it in BindingDB:
Activity Spreadsheet -- Enzyme Inhibition Constant Data from BindingDB
Found 1 hit for monomerid = 50070544
TargetDipeptidyl peptidase 4(Homo sapiens (Human))
Tanabe Seiyaku
Curated by ChEMBL
LigandPNGBDBM50070544((S)-2-({(S)-2-[(S)-2-Amino-3-(1H-indol-3-yl)-propi...)
Affinity DataIC50:  7.90E+3nM. Assay description: Inhibitory concentration of the compound against Dipeptidyl peptidase IV (DPP IV)
In DepthDetails ArticlePubMed