BDBM50071465 Ascomycin derivative::CHEMBL428499
SMILES CC[C@@H]1\C=C(C)\C[C@H](C)C[C@H](OC)[C@H]2O[C@](O)([C@H](C)C[C@@H]2OC)C(=O)C(=O)N2CCCC[C@H]2C(=O)O[C@@H]([C@H](C)[C@@H](O)CC1=O)C(\C)=C\[C@@H]1CC[C@@H](OCc2nc(c[nH]2)-c2ccccc2)[C@@H](C1)OC
InChI Key InChIKey=CJZYWDNEPXNCOT-ZFNFJPMHSA-N
Data  1 EC50
  Tab Delimited (TSV)   2D SDfile   Computed 3D by Vconf -m prep SDfile
Find this compound or compounds like it in BindingDB:
Activity Spreadsheet -- Enzyme Inhibition Constant Data from BindingDB
Found 1 hit for monomerid = 50071465
TargetPeptidyl-prolyl cis-trans isomerase FKBP1A(Homo sapiens (Human))
Merck Research Laboratories
Curated by ChEMBL
LigandPNGBDBM50071465(Ascomycin derivative | CHEMBL428499)
Affinity DataEC50:  22nM. Assay description: Binding affinity of the compound for FK506 binding protein 12 using [3H]-dihydro FK-506 radioligand was determined
In DepthDetails ArticlePubMed