BDBM50073275 CHEMBL331884::N-(3-{(3S,4R)-6-[(E)-2-(7-Chloro-quinolin-2-yl)-vinyl]-4-hydroxy-2,2-dimethyl-chroman-3-ylmethyl}-4-methoxy-phenyl)-C,C,C-trifluoro-methanesulfonamide
SMILES COc1ccc(NS(=O)(=O)C(F)(F)F)cc1C[C@H]1[C@@H](O)c2cc(\C=C\c3ccc4ccc(Cl)cc4n3)ccc2OC1(C)C
InChI Key InChIKey=KLXSFMWSUFMGKA-SXFUJLSXSA-N
Data  1 KI
  Tab Delimited (TSV)   2D SDfile   Computed 3D by Vconf -m prep SDfile
Find this compound or compounds like it in BindingDB:
Activity Spreadsheet -- Enzyme Inhibition Constant Data from BindingDB
Found 1 hit for monomerid = 50073275
TargetCysteinyl leukotriene receptor 1(GUINEA PIG)
Pfizer
Curated by ChEMBL
LigandPNGBDBM50073275(CHEMBL331884 | N-(3-{(3S,4R)-6-[(E)-2-(7-Chloro-qu...)
Affinity DataKi:  5nM. Assay description: Antagonism of Cysteinyl leukotriene receptor 1 from guinea pig lung membranes
In DepthDetails ArticlePubMed