BDBM50073677 N-[(2SR,3S)-3-Amino-5-carbamoyl-2-sulfanylpentanoyl]-L-phenylalanyl-L-glutamic Acid
SMILES NOC(=O)CC[C@H]([NH3+])C(S)C(=O)N[C@H](Cc1ccccc1)C(=O)N[C@@H](CCC(O)=O)C(O)=O
InChI Key InChIKey=AYYZOTZKOLYQBT-NRMMMPIQSA-O
Data  1 KI
  Tab Delimited (TSV)   2D SDfile   Computed 3D by Vconf -m prep SDfile
Find this compound or compounds like it in BindingDB:
Activity Spreadsheet -- Enzyme Inhibition Constant Data from BindingDB
Found 1 hit for monomerid = 50073677
TargetTetanus toxin(Clostridium tetani)
University Of Paris
Curated by ChEMBL
LigandPNGBDBM50073677(N-[(2SR,3S)-3-Amino-5-carbamoyl-2-sulfanylpentanoy...)
Affinity DataKi:  9.00E+4nM. Assay description: Inhibition of tetanus neurotoxin (TeNt)
In DepthDetails ArticlePubMed