BDBM50074332 CHEMBL167463::N,N-Diallyl-N'-(2-bromo-4-trifluoromethoxy-phenyl)-N'-ethyl-6-methyl-[1,3,5]triazine-2,4-diamine
SMILES CCN(c1nc(C)nc(n1)N(CC=C)CC=C)c1ccc(OC(F)(F)F)cc1Br
InChI Key InChIKey=WGMWHDKNTYVJCE-UHFFFAOYSA-N
Data  1 KI
  Tab Delimited (TSV)   2D SDfile   Computed 3D by Vconf -m prep SDfile
Find this compound or compounds like it in BindingDB:
Activity Spreadsheet -- Enzyme Inhibition Constant Data from BindingDB
Found 1 hit for monomerid = 50074332
TargetCorticotropin-releasing factor receptor 1(Homo sapiens (Human))
Dupont Pharmaceuticals
Curated by ChEMBL
LigandPNGBDBM50074332(CHEMBL167463 | N,N-Diallyl-N'-(2-bromo-4-trifluoro...)
Affinity DataKi:  4nM. Assay description: Binding affinity for human recombinant corticotropin releasing factor receptor 1
In DepthDetails ArticlePubMed