BDBM50074333 CHEMBL353877::N*2*-(2-Bromo-4-isopropyl-phenyl)-N*4*-cyclopropyl-N*2*-ethyl-6-methyl-N*4*-propyl-pyrimidine-2,4-diamine
SMILES CCCN(C1CC1)c1cc(C)nc(n1)N(CC)c1ccc(cc1Br)C(C)C
InChI Key InChIKey=QWZWYWPOEFNQOM-UHFFFAOYSA-N
Data  1 KI
  Tab Delimited (TSV)   2D SDfile   Computed 3D by Vconf -m prep SDfile
Find this compound or compounds like it in BindingDB:
Activity Spreadsheet -- Enzyme Inhibition Constant Data from BindingDB
Found 1 hit for monomerid = 50074333
TargetCorticotropin-releasing factor receptor 1(Homo sapiens (Human))
Dupont Pharmaceuticals
Curated by ChEMBL
LigandPNGBDBM50074333(CHEMBL353877 | N*2*-(2-Bromo-4-isopropyl-phenyl)-N...)
Affinity DataKi:  5nM. Assay description: Binding affinity for human recombinant corticotropin releasing factor receptor 1
In DepthDetails ArticlePubMed