BDBM50074452 CHEMBL169952::[3-(2-Bromo-4-isopropyl-phenyl)-5-methyl-3H-[1,2,3]triazolo[4,5-d]pyrimidin-7-yl]-(1-ethyl-pentyl)-amine
SMILES CCCCC(CC)Nc1nc(C)nc2n(nnc12)-c1ccc(cc1Br)C(C)C
InChI Key InChIKey=URKVGMJFEGLMIB-UHFFFAOYSA-N
Data  1 KI
  Tab Delimited (TSV)   2D SDfile   Computed 3D by Vconf -m prep SDfile
Find this compound or compounds like it in BindingDB:
Activity Spreadsheet -- Enzyme Inhibition Constant Data from BindingDB
Found 1 hit for monomerid = 50074452
TargetCorticotropin-releasing factor receptor 1(Homo sapiens (Human))
Dupont Pharmaceuticals
Curated by ChEMBL
LigandPNGBDBM50074452(CHEMBL169952 | [3-(2-Bromo-4-isopropyl-phenyl)-5-m...)
Affinity DataKi:  3.10nM. Assay description: Binding affinity to recombinant human Corticotropin releasing factor receptor 1 (hCRF1) expressed in 293EBNA cells
In DepthDetails ArticlePubMed