BDBM50074807 2-Phenyl-quinoline-4-carboxylic acid (dimethylcarbamoyl-phenyl-methyl)-amide::CHEMBL9955
SMILES CN(C)C(=O)C(NC(=O)c1cc(nc2ccccc12)-c1ccccc1)c1ccccc1
InChI Key InChIKey=FLFKTULMQZFHSS-UHFFFAOYSA-N
Data  3 KI
  Tab Delimited (TSV)   2D SDfile   Computed 3D by Vconf -m prep SDfile
Find this compound or compounds like it in BindingDB:
Activity Spreadsheet -- Enzyme Inhibition Constant Data from BindingDB
Found 1 hit for monomerid = 50074807
TargetNeuromedin-K receptor(Homo sapiens (Human))
Northeast Ohio Medical University
Curated by ChEMBL
LigandPNGBDBM50074807(2-Phenyl-quinoline-4-carboxylic acid (dimethylcarb...)
Affinity DataKi:  501nM. Assay description: Binding affinity to human NK3 receptor expressed in CHO cells
In DepthDetails ArticlePubMed