BDBM50075563 (R)-3-{2-[(R)-3-(4-Carbamimidoyl-phenyl)-4,5-dihydro-isoxazol-5-yl]-acetylamino}-2-(3,5-dimethyl-isoxazole-4-sulfonylamino)-propionic acid; compound with methanesulfonic acid::CHEMBL276741
SMILES Cc1noc(C)c1S(=O)(=O)N[C@H](CNC(=O)C[C@H]1CC(=NO1)c1ccc(cc1)C(N)=N)C(O)=O
InChI Key InChIKey=XKFYFSNOQRUIAO-GDBMZVCRSA-N
Data  2 Kd
  Tab Delimited (TSV)   2D SDfile   Computed 3D by Vconf -m prep SDfile
Find this compound or compounds like it in BindingDB:
Activity Spreadsheet -- Enzyme Inhibition Constant Data from BindingDB
Found 2 hits for monomerid = 50075563
TargetIntegrin alpha-IIb/beta-3(Homo sapiens (Human))
Dupont Pharmaceuticals
Curated by ChEMBL
LigandPNGBDBM50075563((R)-3-{2-[(R)-3-(4-Carbamimidoyl-phenyl)-4,5-dihyd...)
Affinity DataKd:  24nM. Assay description: Dissociation constant for unactivated Fibrinogen Receptor
In DepthDetails ArticlePubMed
TargetIntegrin alpha-IIb/beta-3(Homo sapiens (Human))
Dupont Pharmaceuticals
Curated by ChEMBL
LigandPNGBDBM50075563((R)-3-{2-[(R)-3-(4-Carbamimidoyl-phenyl)-4,5-dihyd...)
Affinity DataKd:  5.90nM. Assay description: Dissociation constant for activated Fibrinogen Receptor
In DepthDetails ArticlePubMed