BDBM50075724 4HOPh(CH2)2CO-DTyr(Me)-Phe-Gln-Asn-Arg-Pro-Lys(5C-Rhm)-NH2::CHEMBL540192
SMILES CN(C)c1ccc2c(Oc3cc(ccc3C22OC(=O)c3cc(ccc23)C(=O)N([C@@H](CCCCN)C(N)=O)C(=O)[C@@H]2CCCN2C(=O)[C@H](CCCNC(N)=N)NC(=O)[C@H](CC(N)=O)NC(=O)[C@H](CCC(N)=O)NC(=O)[C@H](Cc2ccccc2)NC(=O)[C@@H](Cc2ccc(O)cc2)N(C)C(=O)CCc2ccc(O)cc2)N(C)C)c1
InChI Key InChIKey=WUMOOBOQCBFZCV-FECLWYEOSA-N
Data  4 KI
  Tab Delimited (TSV)   2D SDfile   Computed 3D by Vconf -m prep SDfile
Find this compound or compounds like it in BindingDB:
Activity Spreadsheet -- Enzyme Inhibition Constant Data from BindingDB
Found 4 hits for monomerid = 50075724
TargetVasopressin V1a receptor(Homo sapiens (Human))
University Of Montpellier
Curated by ChEMBL
LigandPNGBDBM50075724(4HOPh(CH2)2CO-DTyr(Me)-Phe-Gln-Asn-Arg-Pro-Lys(5C-...)
Affinity DataKi:  0.0700nM. Assay description: Displacement of [125I]- HO-LVA from human Vasopressin V1a receptor in membranes of CHO cells
In DepthDetails ArticlePubMed
TargetOxytocin receptor(Homo sapiens (Human))
University Of Montpellier
Curated by ChEMBL
LigandPNGBDBM50075724(4HOPh(CH2)2CO-DTyr(Me)-Phe-Gln-Asn-Arg-Pro-Lys(5C-...)
Affinity DataKi:  1.20nM. Assay description: The inhibition constant (Ki(nM)) of the compound was determined by displacement of [125I]- HO-LVA radiolabeled ligand using membranes of CHO cells of...
In DepthDetails ArticlePubMed
TargetVasopressin V1b receptor(Homo sapiens (Human))
University Of Montpellier
Curated by ChEMBL
LigandPNGBDBM50075724(4HOPh(CH2)2CO-DTyr(Me)-Phe-Gln-Asn-Arg-Pro-Lys(5C-...)
Affinity DataKi:  27nM. Assay description: The inhibition constant (Ki(nM)) of the compound was determined by displacement of [125I]- HO-LVA radiolabeled ligand using membranes of CHO cells of...
In DepthDetails ArticlePubMed
TargetVasopressin V2 receptor(Homo sapiens (Human))
University Of Montpellier
Curated by ChEMBL
LigandPNGBDBM50075724(4HOPh(CH2)2CO-DTyr(Me)-Phe-Gln-Asn-Arg-Pro-Lys(5C-...)
Affinity DataKi:  7.50E+3nM. Assay description: The inhibition constant (Ki(nM)) of the compound was determined by displacement of [125I]- HO-LVA radiolabeled ligand using membranes of CHO cells of...
In DepthDetails ArticlePubMed