BDBM50075736 CHEMBL3415584
SMILES Cc1cc(C)cc(Nc2cc(N[C@@H]3CCCC[C@@H]3N)cnc2C(N)=O)c1
InChI Key InChIKey=JPLZNLANFXMHIL-DLBZAZTESA-N
Data  1 IC50
  Tab Delimited (TSV)   2D SDfile   Computed 3D by Vconf -m prep SDfile
Find this compound or compounds like it in BindingDB:
Activity Spreadsheet -- Enzyme Inhibition Constant Data from BindingDB
Found 1 hit for monomerid = 50075736
TargetTyrosine-protein kinase SYK(Homo sapiens (Human))
Merck
Curated by ChEMBL
LigandPNGBDBM50075736(CHEMBL3415584)
Affinity DataIC50:  8.80nM. Assay description: Inhibition of full-length GST-tagged human Syk preincubated for 10 mins followed by peptide substrate/ATP addition measured after 45 mins by TR-FRET ...
In DepthDetails ArticlePubMed