BDBM50076415 2-[2-(4-Methyl-piperazin-1-yl)-4-phenyl-quinolin-3-yl]-ethanol::CHEMBL39364
SMILES CN1CCN(CC1)c1nc2ccccc2c(-c2ccccc2)c1CCO
InChI Key InChIKey=GQWTVJMIDSRUDL-UHFFFAOYSA-N
Data  1 KI
  Tab Delimited (TSV)   2D SDfile   Computed 3D by Vconf -m prep SDfile
Find this compound or compounds like it in BindingDB:
Activity Spreadsheet -- Enzyme Inhibition Constant Data from BindingDB
Found 1 hit for monomerid = 50076415
Target5-hydroxytryptamine receptor 3A/3B(Rattus norvegicus)
Universit£
Curated by ChEMBL
LigandPNGBDBM50076415(2-[2-(4-Methyl-piperazin-1-yl)-4-phenyl-quinolin-3...)
Affinity DataKi:  0.400nM. Assay description: Inhibition of [3H]granisetron binding to 5-hydroxytryptamine 3 receptor of rat cortical membrane
In DepthDetails ArticlePubMed