BDBM50076422 4-(2-Fluoro-phenyl)-2-(4-methyl-piperazin-1-yl)-3-[2-(tetrahydro-pyran-2-yloxy)-ethyl]-quinoline::CHEMBL290065
SMILES CN1CCN(CC1)c1nc2ccccc2c(c1CCOC1CCCCO1)-c1ccccc1F
InChI Key InChIKey=JKSRYWNYDVMKPA-UHFFFAOYSA-N
Data  1 KI
  Tab Delimited (TSV)   2D SDfile   Computed 3D by Vconf -m prep SDfile
Find this compound or compounds like it in BindingDB:
Activity Spreadsheet -- Enzyme Inhibition Constant Data from BindingDB
Found 1 hit for monomerid = 50076422
Target5-hydroxytryptamine receptor 3A/3B(Rattus norvegicus)
Universit£
Curated by ChEMBL
LigandPNGBDBM50076422(4-(2-Fluoro-phenyl)-2-(4-methyl-piperazin-1-yl)-3-...)
Affinity DataKi:  1.90nM. Assay description: Inhibition of [3H]granisetron binding to 5-hydroxytryptamine 3 receptor (5-HT 3 receptor) of rat cortex and hippocampus tissue
In DepthDetails ArticlePubMed