BDBM50076608 7-(Butyl-ethyl-amino)-1,5-dimethyl-3-phenyl-1,3-dihydro-imidazo[4,5-b]pyridin-2-one::CHEMBL171893
SMILES CCCCN(CC)c1cc(C)nc2n(-c3ccc(cc3Br)C(C)C)c(=O)n(C)c12
InChI Key InChIKey=XYZOVIXCLDTSDC-UHFFFAOYSA-N
Data  1 KI
  Tab Delimited (TSV)   2D SDfile   Computed 3D by Vconf -m prep SDfile
Find this compound or compounds like it in BindingDB:
Activity Spreadsheet -- Enzyme Inhibition Constant Data from BindingDB
Found 1 hit for monomerid = 50076608
TargetCorticotropin-releasing factor receptor 1(Homo sapiens (Human))
Dupont Pharmaceuticals
Curated by ChEMBL
LigandPNGBDBM50076608(7-(Butyl-ethyl-amino)-1,5-dimethyl-3-phenyl-1,3-di...)
Affinity DataKi:  3nM. Assay description: Binding affinity for transfected human Corticotropin releasing factor receptor expressed in HEK 293E cells using [125I]-TYR-oCRH as the displaced rad...
In DepthDetails ArticlePubMed