BDBM50076794 CHEMBL276602::Lithium; (S)-2-({5-[5-(4-isopropyl-phenyl)-furan-2-ylmethoxymethyl]-2'-methyl-biphenyl-2-carbonyl}-amino)-4-methylsulfanyl-butyrate
SMILES CSCC[C@H](NC(=O)c1ccc(COCc2ccc(o2)-c2ccc(cc2)C(C)C)cc1-c1ccccc1C)C([O-])=O
InChI Key InChIKey=OUAONGDGIKMGQT-HKBQPEDESA-M
Data  1 IC50  1 EC50
  Tab Delimited (TSV)   2D SDfile   Computed 3D by Vconf -m prep SDfile
Find this compound or compounds like it in BindingDB:
Activity Spreadsheet -- Enzyme Inhibition Constant Data from BindingDB
Found 2 hits for monomerid = 50076794
LigandPNGBDBM50076794(CHEMBL276602 | Lithium; (S)-2-({5-[5-(4-isopropyl-...)
Affinity DataEC50:  0.780nM. Assay description: EC50 is measured as inhibition of ras processing in a whole cell assay for farnesyltransferase (FTase)
In DepthDetails ArticlePubMed
LigandPNGBDBM50076794(CHEMBL276602 | Lithium; (S)-2-({5-[5-(4-isopropyl-...)
Affinity DataIC50:  2.90nM. Assay description: In vitro inhibitory activity of the compound was evaluated against farnesyltransferase (FTase)
In DepthDetails ArticlePubMed